add fedora32 docker

15 jobs for master in 21 minutes and 2 seconds (queued for 1 second)
Status Name Job ID Coverage
  Build
failed centos7 #10282

00:01:04

failed centos8 #10283

00:01:56

passed fedora30 #10279

00:02:04

passed fedora31 #10278

00:02:06

failed mageia6 #10308

00:00:50

passed mageia7 #10289

00:01:43

failed opensuse15.1 #10280

00:01:29

passed opensuse-rolling #10281

00:02:02

failed OSX #10306
osx

00:00:55

failed ubuntu16.04 #10284

00:01:30

failed ubuntu18.04 #10285

00:01:32

passed ubuntu19.10 #10286

00:02:18

passed ubuntu20.04 #10287

00:01:30

failed mageia6 #10288

00:00:59

failed OSX #10277
osx

00:01:02

 
Name Stage Failure
failed
OSX Build
                                             ~~~~~~~~~~^
/Users/grunner/builds/DFio91v1/0/jclamber/glnemo2/ui_formabout.h:144:56: error: no member named 'PlaceholderText' in 'QPalette'
palette.setBrush(QPalette::Disabled, QPalette::PlaceholderText, brush8);
~~~~~~~~~~^
3 errors generated.
make[2]: *** [CMakeFiles/glnemo2.dir/src/formabout.cc.o] Error 1
make[1]: *** [CMakeFiles/glnemo2.dir/all] Error 2
make: *** [all] Error 2
ERROR: Job failed: exit status 1
failed
mageia6 Build
CMakeFiles/glnemo2.dir/build.make:531: recipe for target 'CMakeFiles/glnemo2.dir/src/formabout.cc.o' failed
make[2]: *** [CMakeFiles/glnemo2.dir/src/formabout.cc.o] Error 1
make[1]: *** [CMakeFiles/glnemo2.dir/all] Error 2
make: *** [all] Error 2
CMakeFiles/Makefile2:104: recipe for target 'CMakeFiles/glnemo2.dir/all' failed
Makefile:149: recipe for target 'all' failed
Running after_script
Uploading artifacts for failed job
ERROR: Job failed: exit code 1
failed
ubuntu16.04 Build
make[2]: *** [CMakeFiles/glnemo2.dir/src/mainwindow.cc.o] Error 1
CMakeFiles/glnemo2.dir/build.make:891: recipe for target 'CMakeFiles/glnemo2.dir/src/mainwindow.cc.o' failed
CMakeFiles/Makefile2:104: recipe for target 'CMakeFiles/glnemo2.dir/all' failed
make[1]: *** [CMakeFiles/glnemo2.dir/all] Error 2
Makefile:149: recipe for target 'all' failed
make: *** [all] Error 2
Running after_script
Uploading artifacts for failed job
ERROR: Job failed: exit code 1
failed
ubuntu18.04 Build
make[2]: *** [CMakeFiles/glnemo2.dir/src/formabout.cc.o] Error 1
CMakeFiles/glnemo2.dir/build.make:531: recipe for target 'CMakeFiles/glnemo2.dir/src/formabout.cc.o' failed
make[1]: *** [CMakeFiles/glnemo2.dir/all] Error 2
CMakeFiles/Makefile2:104: recipe for target 'CMakeFiles/glnemo2.dir/all' failed
Makefile:151: recipe for target 'all' failed
make: *** [all] Error 2
Running after_script
Uploading artifacts for failed job
ERROR: Job failed: exit code 1
failed
opensuse15.1 Build
/builds/jclamber/glnemo2/ui_formabout.h:144:56: error: 'PlaceholderText' is not a member of 'QPalette'
palette.setBrush(QPalette::Disabled, QPalette::PlaceholderText, brush8);
^~~~~~~~~~~~~~~
make[2]: *** [CMakeFiles/glnemo2.dir/build.make:532: CMakeFiles/glnemo2.dir/src/formabout.cc.o] Error 1
make[1]: *** [CMakeFiles/Makefile2:105: CMakeFiles/glnemo2.dir/all] Error 2
make: *** [Makefile:152: all] Error 2
Running after_script
Uploading artifacts for failed job
ERROR: Job failed: exit code 1
failed
centos7 Build
/builds/jclamber/glnemo2/ui_formabout.h:144:46: error: 'PlaceholderText' is not a member of 'QPalette'
palette.setBrush(QPalette::Disabled, QPalette::PlaceholderText, brush8);
^
make[2]: *** [CMakeFiles/glnemo2.dir/src/mainwindow.cc.o] Error 1
make[1]: *** [CMakeFiles/glnemo2.dir/all] Error 2
make: *** [all] Error 2
Running after_script
Uploading artifacts for failed job
ERROR: Job failed: exit code 1
failed
centos8 Build
/builds/jclamber/glnemo2/ui_formabout.h:142:56: error: 'PlaceholderText' is not a member of 'QPalette'
palette.setBrush(QPalette::Disabled, QPalette::PlaceholderText, brush8);
^~~~~~~~~~~~~~~
make[2]: *** [CMakeFiles/glnemo2.dir/build.make:913: CMakeFiles/glnemo2.dir/src/mainwindow.cc.o] Error 1
make[1]: *** [CMakeFiles/Makefile2:61: CMakeFiles/glnemo2.dir/all] Error 2
make: *** [Makefile:137: all] Error 2
Running after_script
Uploading artifacts for failed job
ERROR: Job failed: exit code 1