add CI

2 jobs for new_setup in 7 minutes and 27 seconds (queued for 2 seconds)
Status Job ID Name Coverage
  Build
canceled #5078
manylinux1

00:03:24

failed #5077
manylinux2010

00:04:03

 
Name Stage Failure
failed
manylinux2010 Build
[  1%] Building CXX object CMakeFiles/JCLprojects.dir/lib/projects/nemodep/cbar.cc.o
/builds/jclamber/uns_projects/lib/projects/nemodep/cbar.cc:16:10: fatal error: uns.h: No such file or directory
#include "uns.h"
^~~~~~~
compilation terminated.
make[2]: *** [CMakeFiles/JCLprojects.dir/lib/projects/nemodep/cbar.cc.o] Error 1
make[1]: *** [CMakeFiles/JCLprojects.dir/all] Error 2
make: *** [all] Error 2
ERROR: Job failed: exit code 1